BDBM50313389 (4aS,5R,10bS)-9-isopropyl-5-phenyl-3,4,4a,5,6,10b-hexahydro-2H-pyrano[3,2-c]quinoline::CHEMBL1092159
SMILES CC(C)c1ccc2N[C@H]([C@@H]3CCCO[C@@H]3c2c1)c1ccccc1
InChI Key InChIKey=TYKPBPZKWOTNSY-YYWHXJBOSA-N
Data  1 IC50
  Tab Delimited (TSV)   2D SDfile   Computed 3D by Vconf -m prep SDfile
Find this compound or compounds like it in BindingDB:
Activity Spreadsheet -- Enzyme Inhibition Constant Data from BindingDB
Found 1 hit for monomerid = 50313389
TargetKinesin-like protein KIF11(Homo sapiens (Human))
Merck Serono
Curated by ChEMBL
LigandPNGBDBM50313389((4aS,5R,10bS)-9-isopropyl-5-phenyl-3,4,4a,5,6,10b-...)
Affinity DataIC50:  130nM. Assay description: Inhibition of ATPase activity of human recombinant EG5 assessed as ATP hydrolysis by pyruvate kinase-lactate dehydrogenase coupled assay
In DepthDetails ArticlePubMed