BDBM50313459 (Z)-4-oxo-4-(p-tolylamino)but-2-enoic acid::CHEMBL1078976
SMILES Cc1ccc(NC(=O)\C=C/C(O)=O)cc1
InChI Key InChIKey=VLWFSWMZGGZHGD-SREVYHEPSA-N
Data  1 IC50
  Tab Delimited (TSV)   2D SDfile   Computed 3D by Vconf -m prep SDfile
Find this compound or compounds like it in BindingDB:
Activity Spreadsheet -- Enzyme Inhibition Constant Data from BindingDB
Found 1 hit for monomerid = 50313459
TargetGlycylpeptide N-tetradecanoyltransferase 1(Homo sapiens (Human))
Acadia University
Curated by ChEMBL
LigandPNGBDBM50313459((Z)-4-oxo-4-(p-tolylamino)but-2-enoic acid | CHEMB...)
Affinity DataIC50:  5.30E+4nM. Assay description: Inhibition of human NMT expressed in Escherichia coli DH5alpha cells
In DepthDetails ArticlePubMed