BDBM50313503 3,5-dioxo-4-propyl-2-(3-(trifluoromethyl)phenyl)-2,3,4,5-tetrahydro-1,2,4-triazine-6-carbonitrile::CHEMBL1077304
SMILES CCCn1c(=O)c(nn(-c2cccc(c2)C(F)(F)F)c1=O)C#N
InChI Key InChIKey=SWCYSOAYGXXNLX-UHFFFAOYSA-N
Data  1 IC50
  Tab Delimited (TSV)   2D SDfile   Computed 3D by Vconf -m prep SDfile
Find this compound or compounds like it in BindingDB:
Activity Spreadsheet -- Enzyme Inhibition Constant Data from BindingDB
Found 1 hit for monomerid = 50313503
TargetCathepsin K(Homo sapiens (Human))
Schering-Plough
Curated by ChEMBL
LigandPNGBDBM50313503(3,5-dioxo-4-propyl-2-(3-(trifluoromethyl)phenyl)-2...)
Affinity DataIC50:  2.00E+3nM. Assay description: Inhibition of human recombinant cathepsin K by fluorescence assay
In DepthDetails ArticlePubMed