BDBM50313782 CHEMBL1089377::benzyl cyanomethyl(piperidin-4-yl)carbamate
SMILES O=C(OCc1ccccc1)N(CC#N)C1CCNCC1
InChI Key InChIKey=VSRJPANZVLBBIX-UHFFFAOYSA-N
Data  1 IC50
  Tab Delimited (TSV)   2D SDfile   Computed 3D by Vconf -m prep SDfile
Find this compound or compounds like it in BindingDB:
Activity Spreadsheet -- Enzyme Inhibition Constant Data from BindingDB
Found 1 hit for monomerid = 50313782
TargetMetacaspase-2(Trypanosoma brucei)
University Of Antwerp
Curated by ChEMBL
LigandPNGBDBM50313782(CHEMBL1089377 | benzyl cyanomethyl(piperidin-4-yl)...)
Affinity DataIC50: >1.00E+5nM. Assay description: Inhibition of Trypanosoma brucei MAC2
In DepthDetails ArticlePubMed