BDBM50313846 (R)-5-(4-fluorophenyl)-5-((5-hydroxy-1-oxoisoindolin-2-yl)methyl)imidazolidine-2,4-dione::CHEMBL1090059
SMILES Oc1ccc2C(=O)N(C[C@]3(NC(=O)NC3=O)c3ccc(F)cc3)Cc2c1
InChI Key InChIKey=FSTVBTPVQKBNHI-SFHVURJKSA-N
Data  1 KI
  Tab Delimited (TSV)   2D SDfile   Computed 3D by Vconf -m prep SDfile
Find this compound or compounds like it in BindingDB:
Activity Spreadsheet -- Enzyme Inhibition Constant Data from BindingDB
Found 1 hit for monomerid = 50313846
TargetDisintegrin and metalloproteinase domain-containing protein 17(Homo sapiens (Human))
Merck Research Laboratories
Curated by ChEMBL
LigandPNGBDBM50313846((R)-5-(4-fluorophenyl)-5-((5-hydroxy-1-oxoisoindol...)
Affinity DataKi:  0.5nM. Assay description: Inhibition of TACE by FRET assay
In DepthDetails ArticlePubMed