BDBM50313855 (R)-5-chloro-1-(1-cyclopropylethyl)-3-(2,6-dimethoxypyridin-3-ylamino)pyrazin-2(1H)-one::CHEMBL1084414
SMILES COc1ccc(Nc2nc(Cl)cn([C@H](C)C3CC3)c2=O)c(OC)n1
InChI Key InChIKey=KIDHPANWQCFYNM-SECBINFHSA-N
Data  1 IC50
  Tab Delimited (TSV)   2D SDfile   Computed 3D by Vconf -m prep SDfile
Find this compound or compounds like it in BindingDB:
Activity Spreadsheet -- Enzyme Inhibition Constant Data from BindingDB
Found 1 hit for monomerid = 50313855
TargetCorticotropin-releasing factor receptor 1(Rattus norvegicus (rat))
Bristol-Myers Squibb
Curated by ChEMBL
LigandPNGBDBM50313855((R)-5-chloro-1-(1-cyclopropylethyl)-3-(2,6-dimetho...)
Affinity DataIC50:  17nM. Assay description: Displacement of [125I]Tyr-ovine-CRF from CRF1 receptor in rat frontal cortex homogenate by gamma counting
In DepthDetails ArticlePubMed