BDBM50314031 (6S,9S,12S,15S,18S,21S,24S)-21-((1H-imidazol-5-yl)methyl)-1-amino-18-butyl-24-(hydroxymethyl)-1-imino-12,15-diisobutyl-9-methyl-8,11,14,17,20,23,26-heptaoxo-2,7,10,13,16,19,22,25-octaazaheptacosane-6-carboxylic acid::CHEMBL1089585
SMILES CCCC[C@H](NC(=O)[C@H](Cc1cnc[nH]1)NC(=O)[C@H](CO)NC(C)=O)C(=O)N[C@@H](CC(C)C)C(=O)N[C@@H](CC(C)C)C(=O)N[C@@H](C)C(=O)N[C@@H](CCCN=C(N)N)C(O)=O
InChI Key InChIKey=RRSFEYSWMRFZBB-ODKJCKIQSA-N
Data  1 IC50
  Tab Delimited (TSV)   2D SDfile   Computed 3D by Vconf -m prep SDfile
Find this compound or compounds like it in BindingDB:
Activity Spreadsheet -- Enzyme Inhibition Constant Data from BindingDB
Found 1 hit for monomerid = 50314031
TargetComplement factor B(Homo sapiens (Human))
The University Of Queensland
Curated by ChEMBL
LigandPNGBDBM50314031((6S,9S,12S,15S,18S,21S,24S)-21-((1H-imidazol-5-yl)...)
Affinity DataIC50:  5.00E+3nMpH: 9.5Assay Description:Inhibition of human complement factor B treated for 5 mins before addition of substrate Ac-SHLGLAR-pNA at pH 9.5 by chromogenic assay
In DepthDetails ArticlePubMed