BDBM50314128 (S,E)-Methyl 2-(4-Ethoxy-4-oxobut-2-enamido)-5-oxo-5-(tritylamino)pentanoate::CHEMBL1092456
SMILES CCOC(=O)\C=C\C(=O)N[C@@H](CCC(=O)NC(c1ccccc1)(c1ccccc1)c1ccccc1)C(=O)OC
InChI Key InChIKey=KDFYYCWOAJDFMS-RFJJORBGSA-N
Data  1 KI
  Tab Delimited (TSV)   2D SDfile   Computed 3D by Vconf -m prep SDfile
Find this compound or compounds like it in BindingDB:
Activity Spreadsheet -- Enzyme Inhibition Constant Data from BindingDB
Found 1 hit for monomerid = 50314128
TargetCysteine protease(Trypanosoma brucei rhodesiense)
University Of W£Rzburg
Curated by ChEMBL
LigandPNGBDBM50314128((S,E)-Methyl 2-(4-Ethoxy-4-oxobut-2-enamido)-5-oxo...)
Affinity DataKi:  1.40E+3nM. Assay description: Inhibition of Trypanosoma brucei rhodesiense recombinant rhodesain by standard fluorescence assay
In DepthDetails ArticlePubMed