BDBM50314455 (S)-N-((S)-2-((S)-2-(4-(benzo[d]isoxazol-3-yl)thiazol-2-yl)pyrrolidin-1-yl)-1-cyclohexyl-2-oxoethyl)-2-(methylamino)propanamide::CHEMBL1094001
SMILES CN[C@@H](C)C(=O)N[C@@H](C1CCCCC1)C(=O)N1CCC[C@H]1c1nc(cs1)-c1noc2ccccc12
InChI Key InChIKey=YNQNHLWGHBFRFI-BUKVSMQUSA-N
Data  2 KI
  Tab Delimited (TSV)   2D SDfile   Computed 3D by Vconf -m prep SDfile
Find this compound or compounds like it in BindingDB:
Activity Spreadsheet -- Enzyme Inhibition Constant Data from BindingDB
Found 2 hits for monomerid = 50314455
TargetE3 ubiquitin-protein ligase XIAP(Homo sapiens (Human))
Genentech
Curated by ChEMBL
LigandPNGBDBM50314455((S)-N-((S)-2-((S)-2-(4-(benzo[d]isoxazol-3-yl)thia...)
Affinity DataKi:  1.20E+5nM. Assay description: Antagonist activity at XIAP BIR3 domain by fluorescence polarization assay ... On Thursday, November 10, 2011 9:19 AM from cohen.fred@gene.com: Unfor...Checked by Author
In DepthDetails ArticlePubMed
TargetBaculoviral IAP repeat-containing protein 7(Homo sapiens (Human))
Genentech
Curated by ChEMBL
LigandPNGBDBM50314455((S)-N-((S)-2-((S)-2-(4-(benzo[d]isoxazol-3-yl)thia...)
Affinity DataKi:  1.30E+5nM. Assay description: Antagonist activity at ML-IAP MLXBIR3SG domain by fluorescence polarization assay ... On Thursday, November 10, 2011 9:19 AM from cohen.fred@gene.com...Checked by Author
In DepthDetails ArticlePubMed