BDBM50314469 (S)-N-((S)-1-cyclohexyl-2-oxo-2-((S)-2-(4-(pyridin-4-yl)benzo[d]thiazol-2-yl)pyrrolidin-1-yl)ethyl)-2-(methylamino)propanamide::CHEMBL1089694
SMILES CN[C@@H](C)C(=O)N[C@@H](C1CCCCC1)C(=O)N1CCC[C@H]1c1nc2c(cccc2s1)-c1ccncc1
InChI Key InChIKey=WQFARPRDXJNKOW-OEOAZWSVSA-N
Data  2 KI
  Tab Delimited (TSV)   2D SDfile   Computed 3D by Vconf -m prep SDfile
Find this compound or compounds like it in BindingDB:
Activity Spreadsheet -- Enzyme Inhibition Constant Data from BindingDB
Found 2 hits for monomerid = 50314469
TargetE3 ubiquitin-protein ligase XIAP(Homo sapiens (Human))
Genentech
Curated by ChEMBL
LigandPNGBDBM50314469((S)-N-((S)-1-cyclohexyl-2-oxo-2-((S)-2-(4-(pyridin...)
Affinity DataKi:  6.00E+4nM. Assay description: Antagonist activity at XIAP BIR3 domain by fluorescence polarization assay ... On Thursday, November 10, 2011 9:19 AM from cohen.fred@gene.com: Unfor...Checked by Author
In DepthDetails ArticlePubMed
TargetBaculoviral IAP repeat-containing protein 7(Homo sapiens (Human))
Genentech
Curated by ChEMBL
LigandPNGBDBM50314469((S)-N-((S)-1-cyclohexyl-2-oxo-2-((S)-2-(4-(pyridin...)
Affinity DataKi:  4.60E+5nM. Assay description: Antagonist activity at ML-IAP MLXBIR3SG domain by fluorescence polarization assay ... On Thursday, November 10, 2011 9:19 AM from cohen.fred@gene.com...Checked by Author
In DepthDetails ArticlePubMed