BDBM50314572 (4-(3-(1,2-dimethyl-7-phenyl-1H-pyrrolo[3,2-d]pyridazin-4-ylamino)propyl)piperazin-1-yl)(pyrimidin-2-yl)methanone::CHEMBL1093071
SMILES Cc1cc2c(NCCCN3CCN(CC3)C(=O)c3ncccn3)nnc(-c3ccccc3)c2n1C
InChI Key InChIKey=ZSJZRGXQTCYCKH-UHFFFAOYSA-N
Data  2 KI
  Tab Delimited (TSV)   2D SDfile   Computed 3D by Vconf -m prep SDfile
Find this compound or compounds like it in BindingDB:
Activity Spreadsheet -- Enzyme Inhibition Constant Data from BindingDB
Found 2 hits for monomerid = 50314572
TargetcAMP-specific 3',5'-cyclic phosphodiesterase 4B(Homo sapiens (Human))
Pfizer
Curated by ChEMBL
LigandPNGBDBM50314572((4-(3-(1,2-dimethyl-7-phenyl-1H-pyrrolo[3,2-d]pyri...)
Affinity DataKi:  2.62E+4nM. Assay description: Displacement of [methyl-3H]rolipram from PDE4B3 expressed in CHO cells after 1 hr by scintillation counting
In DepthDetails ArticlePubMed
TargetcAMP-specific 3',5'-cyclic phosphodiesterase 4D(Homo sapiens (Human))
Pfizer
Curated by ChEMBL
LigandPNGBDBM50314572((4-(3-(1,2-dimethyl-7-phenyl-1H-pyrrolo[3,2-d]pyri...)
Affinity DataKi: >1.00E+5nM. Assay description: Displacement of [methyl-3H]rolipram from PDE4D4 expressed in CHO cells after 1 hr by scintillation counting
In DepthDetails ArticlePubMed