BDBM50314727 1-(thiazol-2-yl)ethanone O-cyclohexanecarbonyl oxime::CHEMBL1092791
SMILES C\C(=N/OC(=O)C1CCCCC1)c1nccs1
InChI Key InChIKey=RRXZTDHBRAEGPA-NTEUORMPSA-N
Data  1 IC50
  Tab Delimited (TSV)   2D SDfile   Computed 3D by Vconf -m prep SDfile
Find this compound or compounds like it in BindingDB:
Activity Spreadsheet -- Enzyme Inhibition Constant Data from BindingDB
Found 1 hit for monomerid = 50314727
TargetSerine hydrolase RBBP9(Homo sapiens (Human))
The Scripps Research Institute
Curated by ChEMBL
LigandPNGBDBM50314727(1-(thiazol-2-yl)ethanone O-cyclohexanecarbonyl oxi...)
Affinity DataIC50:  640nM. Assay description: Displacement of fluorophosphate-rhodamine from RBBP9 transfected in human HEK293T cells proteomes after 30 mins by SDS-PAGE gel fluorescence assay
In DepthDetails ArticlePubMed