BDBM50314846 1-(3'-Deoxy-5'-O-triphenylmethyl-beta-D-thymidin-3'-yl)-3-(4-chloro-3-(trifluoromethyl)-phenyl)-thiourea::CHEMBL1092055
SMILES Cc1cn([C@H]2C[C@H](NC(=S)Nc3ccc(Cl)c(c3)C(F)(F)F)[C@@H](COC(c3ccccc3)(c3ccccc3)c3ccccc3)O2)c(=O)[nH]c1=O
InChI Key InChIKey=DMHANHXEZBTSGC-DCMFLLSESA-N
Data  4 IC50
  Tab Delimited (TSV)   2D SDfile   Computed 3D by Vconf -m prep SDfile
Find this compound or compounds like it in BindingDB:
Activity Spreadsheet -- Enzyme Inhibition Constant Data from BindingDB
Found 4 hits for monomerid = 50314846
TargetThymidine kinase 2, mitochondrial(Homo sapiens (Human))
Ghent University
Curated by ChEMBL
LigandPNGBDBM50314846(1-(3'-Deoxy-5'-O-triphenylmethyl-beta-D-thymidin-3...)
Affinity DataIC50: >5.00E+5nM. Assay description: Inhibition of human recombinant mitochondrial thymidine kinase 2 assessed as inhibition of [methyl-3H]dThd phosphorylation after 30 mins by scintilla...
In DepthDetails ArticlePubMed
TargetThymidine kinase, cytosolic(Homo sapiens (Human))
Ghent University
Curated by ChEMBL
LigandPNGBDBM50314846(1-(3'-Deoxy-5'-O-triphenylmethyl-beta-D-thymidin-3...)
Affinity DataIC50: >5.00E+5nM. Assay description: Inhibition of human recombinant cytosolic thymidine kinase 1 assessed as inhibition of [methyl-3H]dThd phosphorylation after 30 mins by scintillation...
In DepthDetails ArticlePubMed
TargetDeoxynucleoside kinase(Drosophila melanogaster)
Ghent University
Curated by ChEMBL
LigandPNGBDBM50314846(1-(3'-Deoxy-5'-O-triphenylmethyl-beta-D-thymidin-3...)
Affinity DataIC50: >5.00E+5nM. Assay description: Inhibition of Drosophila melanogaster multifunctional deoxynucleoside kinase assessed as inhibition of [methyl-3H]dThd phosphorylation after 30 mins ...
In DepthDetails ArticlePubMed
TargetThymidine kinase(Human herpesvirus 1 (strain SC16) (HHV-1) (Human h...)
Ghent University
Curated by ChEMBL
LigandPNGBDBM50314846(1-(3'-Deoxy-5'-O-triphenylmethyl-beta-D-thymidin-3...)
Affinity DataIC50: >5.00E+5nM. Assay description: Inhibition of HSV1 thymidine kinase assessed as inhibition of [methyl-3H]dThd phosphorylation after 30 mins by scintillation counting
In DepthDetails ArticlePubMed