BDBM50314970 3-(4-(2-(4-(2,2-dimethylbutyl)-1H-imidazol-2-yl)ethyl)phenyl)pyridine::CHEMBL1091599
SMILES CCC(C)(C)Cc1cnc(CCc2ccc(cc2)-c2cccnc2)[nH]1
InChI Key InChIKey=XIDSDIGHYCDNCQ-UHFFFAOYSA-N
Data  1 IC50  4 EC50
  Tab Delimited (TSV)   2D SDfile   Computed 3D by Vconf -m prep SDfile
Find this compound or compounds like it in BindingDB:
Activity Spreadsheet -- Enzyme Inhibition Constant Data from BindingDB
Found 5 hits for monomerid = 50314970
TargetBombesin receptor subtype-3(Homo sapiens (Human))
Merck Research Laboratories
Curated by ChEMBL
LigandPNGBDBM50314970(3-(4-(2-(4-(2,2-dimethylbutyl)-1H-imidazol-2-yl)et...)
Affinity DataIC50:  7.5nM. Assay description: Displacement of [125I]D-Tyr6-betaAla11-Phe13-Nle14-bombesin from human BRS-3 expressed in NFAT-CHO cells after 2 hrs by scintillation counting
In DepthDetails ArticlePubMed
TargetBombesin receptor subtype-3(Homo sapiens (Human))
Merck Research Laboratories
Curated by ChEMBL
LigandPNGBDBM50314970(3-(4-(2-(4-(2,2-dimethylbutyl)-1H-imidazol-2-yl)et...)
Affinity DataEC50:  131nM. Assay description: Agonist activity at human BRS-3 expressed in HEK293 cells coexpressing AEQ over 10 mins by aequorin bioluminescence assay
In DepthDetails ArticlePubMed
TargetBombesin receptor subtype-3(Mus musculus)
Merck Research Laboratories
Curated by ChEMBL
LigandPNGBDBM50314970(3-(4-(2-(4-(2,2-dimethylbutyl)-1H-imidazol-2-yl)et...)
Affinity DataEC50:  97nM. Assay description: Agonist activity at mouse BRS-3 expressed in HEK293 cells coexpressing AEQ over 10 mins by aequorin bioluminescence assay relative to D-Tyr6-betaAla1...
In DepthDetails ArticlePubMed
TargetBombesin receptor subtype-3(Mus musculus)
Merck Research Laboratories
Curated by ChEMBL
LigandPNGBDBM50314970(3-(4-(2-(4-(2,2-dimethylbutyl)-1H-imidazol-2-yl)et...)
Affinity DataEC50:  4.30nM. Assay description: Agonist activity at mouse BRS-3 expressed in HEK293 cells coexpressing AEQ over 10 mins by aequorin bioluminescence assay
In DepthDetails ArticlePubMed
TargetBombesin receptor subtype-3(Homo sapiens (Human))
Merck Research Laboratories
Curated by ChEMBL
LigandPNGBDBM50314970(3-(4-(2-(4-(2,2-dimethylbutyl)-1H-imidazol-2-yl)et...)
Affinity DataEC50:  98nM. Assay description: Agonist activity at human BRS-3 expressed in HEK293 cells coexpressing AEQ over 10 mins by aequorin bioluminescence assay relative to D-Tyr6-betaAla1...
In DepthDetails ArticlePubMed