BDBM50315351 CHEMBL1088879::benzyl 1-acetyl-2-phenethylpyrrolidine-2-carboxylate
SMILES CC(=O)N1CCCC1(CCc1ccccc1)C(=O)OCc1ccccc1
InChI Key InChIKey=GMCIEQJAXHIEFJ-UHFFFAOYSA-N
Data  1 IC50
  Tab Delimited (TSV)   2D SDfile   Computed 3D by Vconf -m prep SDfile
Find this compound or compounds like it in BindingDB:
Activity Spreadsheet -- Enzyme Inhibition Constant Data from BindingDB
Found 1 hit for monomerid = 50315351
TargetSolute carrier family 12 member 5(Rattus norvegicus)
Ucb Pharma
Curated by ChEMBL
LigandPNGBDBM50315351(CHEMBL1088879 | benzyl 1-acetyl-2-phenethylpyrroli...)
Affinity DataIC50:  8.00E+3nM. Assay description: Antagonist activity of rat KCC2 transporter expressed in human SK-Hep cells assessed as inhibition of N-ethylmaleimide-mediated Rb+ influx after 10 m...
In DepthDetails ArticlePubMed