BDBM50315377 CHEMBL1092317::benzyl 1-benzoyl-2-benzylpyrrolidine-2-carboxylate
SMILES O=C(OCc1ccccc1)C1(Cc2ccccc2)CCCN1C(=O)c1ccccc1
InChI Key InChIKey=CSOHPLLDZRUYES-UHFFFAOYSA-N
Data  1 IC50
  Tab Delimited (TSV)   2D SDfile   Computed 3D by Vconf -m prep SDfile
Find this compound or compounds like it in BindingDB:
Activity Spreadsheet -- Enzyme Inhibition Constant Data from BindingDB
Found 1 hit for monomerid = 50315377
TargetSolute carrier family 12 member 5(Rattus norvegicus)
Ucb Pharma
Curated by ChEMBL
LigandPNGBDBM50315377(CHEMBL1092317 | benzyl 1-benzoyl-2-benzylpyrrolidi...)
Affinity DataIC50:  4.00E+3nM. Assay description: Antagonist activity of rat KCC2 transporter expressed in human SK-Hep cells assessed as inhibition of N-ethylmaleimide-mediated Rb+ influx after 10 m...
In DepthDetails ArticlePubMed