BDBM50315386 2-chlorobenzyl 1-acetyl-2-benzylpyrrolidine-2-carboxylate::CHEMBL1089193
SMILES CC(=O)N1CCCC1(Cc1ccccc1)C(=O)OCc1ccccc1Cl
InChI Key InChIKey=RNZARZIVIVVFRK-UHFFFAOYSA-N
Data  1 IC50
  Tab Delimited (TSV)   2D SDfile   Computed 3D by Vconf -m prep SDfile
Find this compound or compounds like it in BindingDB:
Activity Spreadsheet -- Enzyme Inhibition Constant Data from BindingDB
Found 1 hit for monomerid = 50315386
TargetSolute carrier family 12 member 5(Rattus norvegicus)
Ucb Pharma
Curated by ChEMBL
LigandPNGBDBM50315386(2-chlorobenzyl 1-acetyl-2-benzylpyrrolidine-2-carb...)
Affinity DataIC50:  6.00E+3nM. Assay description: Antagonist activity of rat KCC2 transporter expressed in human SK-Hep cells assessed as inhibition of N-ethylmaleimide-mediated Rb+ influx after 10 m...
In DepthDetails ArticlePubMed