BDBM50315565 2-morpholino-2-phenylethanol::CHEMBL1090791
SMILES OCC(N1CCOCC1)c1ccccc1
InChI Key InChIKey=DWRQJSYKHGJWPN-UHFFFAOYSA-N
Data  2 IC50
  Tab Delimited (TSV)   2D SDfile   Computed 3D by Vconf -m prep SDfile
Find this compound or compounds like it in BindingDB:
Activity Spreadsheet -- Enzyme Inhibition Constant Data from BindingDB
Found 2 hits for monomerid = 50315565
TargetPotassium voltage-gated channel subfamily H member 2(Homo sapiens (Human))
Merck Research Laboratories
Curated by ChEMBL
LigandPNGBDBM50315565(2-morpholino-2-phenylethanol | CHEMBL1090791)
Affinity DataIC50: >6.00E+4nM. Assay description: Inhibition of human ERG
In DepthDetails ArticlePubMed
TargetPotassium voltage-gated channel subfamily A member 5(Homo sapiens (Human))
Merck Research Laboratories
Curated by ChEMBL
LigandPNGBDBM50315565(2-morpholino-2-phenylethanol | CHEMBL1090791)
Affinity DataIC50: >6.00E+4nM. Assay description: Inhibition of human Kv1.5 channel expressed in CHO cells by whole cell patch clamp assay
In DepthDetails ArticlePubMed