BDBM50315705 CHEMBL1195244
SMILES OC(Cn1ccnc1)c1cccc(c1)-c1ccccc1
InChI Key InChIKey=JWWMXZIDNWAXKR-UHFFFAOYSA-N
Data  2 IC50
  Tab Delimited (TSV)   2D SDfile   Computed 3D by Vconf -m prep SDfile
Find this compound or compounds like it in BindingDB:
Activity Spreadsheet -- Enzyme Inhibition Constant Data from BindingDB
Found 2 hits for monomerid = 50315705
TargetHeme oxygenase 1(Rattus norvegicus (rat))
University Of Catania
Curated by ChEMBL
LigandPNGBDBM50315705(CHEMBL1195244)
Affinity DataIC50:  900nM. Assay description: Inhibition of HO-1 in Sprague-Dawley albino rat spleen microsomes assessed as reduction in bilirubin formation using hemin as substrate after 60 mins...
In DepthDetails ArticlePubMed
TargetHeme oxygenase 2(Rattus norvegicus (rat))
University Of Catania
Curated by ChEMBL
LigandPNGBDBM50315705(CHEMBL1195244)
Affinity DataIC50: >1.00E+5nM. Assay description: Inhibition of HO-2 in Sprague-Dawley albino rat brain microsomes assessed as reduction in bilirubin formation using hemin as substrate after 60 mins ...
In DepthDetails ArticlePubMed