BDBM50315715 ((3S,4R,5R)-4-(3,4-difluorophenyl)-4-hydroxy-3,5-dimethylpiperidin-1-yl)((3S,4R)-4-(2,4-difluorophenyl)pyrrolidin-3-yl)methanone::CHEMBL1092211
SMILES C[C@H]1CN(C[C@@H](C)[C@]1(O)c1ccc(F)c(F)c1)C(=O)[C@@H]1CNC[C@H]1c1ccc(F)cc1F
InChI Key InChIKey=FHCVSUWWTUKUEF-FEYUIWKASA-N
Data  1 EC50
  Tab Delimited (TSV)   2D SDfile   Computed 3D by Vconf -m prep SDfile
Find this compound or compounds like it in BindingDB:
Activity Spreadsheet -- Enzyme Inhibition Constant Data from BindingDB
Found 1 hit for monomerid = 50315715
TargetMelanocortin receptor 4(Homo sapiens (Human))
Pfizer
Curated by ChEMBL
LigandPNGBDBM50315715(((3S,4R,5R)-4-(3,4-difluorophenyl)-4-hydroxy-3,5-d...)
Affinity DataEC50:  288nM. Assay description: Agonist activity at human recombinant MC4 receptor expressed in CHO cells by cAMP responsive beta lactamase reporter gene assay
In DepthDetails ArticlePubMed