BDBM50315795 6-Fluoro-2-(2-fluoro-4-piperidin-2-ylphenyl)-1H-benzimidazole-4-carboxamide::CHEMBL1089132
SMILES NC(=O)c1cc(F)cc2[nH]c(nc12)-c1ccc(cc1F)C1CCCCN1
InChI Key InChIKey=IKMSCTKNIPLUAO-UHFFFAOYSA-N
Data  1 KI  1 EC50
  Tab Delimited (TSV)   2D SDfile   Computed 3D by Vconf -m prep SDfile
Find this compound or compounds like it in BindingDB:
Activity Spreadsheet -- Enzyme Inhibition Constant Data from BindingDB
Found 2 hits for monomerid = 50315795
TargetPoly [ADP-ribose] polymerase 1(Homo sapiens (Human))
Abbott Laboratories
Curated by ChEMBL
LigandPNGBDBM50315795(6-Fluoro-2-(2-fluoro-4-piperidin-2-ylphenyl)-1H-be...)
Affinity DataKi:  2nM. Assay description: Inhibition of PARP1 using [3H]NAD+ by top count scintillation counting
In DepthDetails ArticlePubMed
TargetPoly [ADP-ribose] polymerase 1(Homo sapiens (Human))
Abbott Laboratories
Curated by ChEMBL
LigandPNGBDBM50315795(6-Fluoro-2-(2-fluoro-4-piperidin-2-ylphenyl)-1H-be...)
Affinity DataEC50:  2nM. Assay description: Inhibition of PARP1 in human C41 cells by FITC-conjugated DAPI staining
In DepthDetails ArticlePubMed