BDBM50316117 2-Allylthio-3-benzyl-6-diallylamino-quinazolin-4(3H)-one::CHEMBL1093230
SMILES C=CCSc1nc2ccc(cc2c(=O)n1Cc1ccccc1)N(CC=C)CC=C
InChI Key InChIKey=RYURKAVMEWUSDI-UHFFFAOYSA-N
Data  2 IC50
  Tab Delimited (TSV)   2D SDfile   Computed 3D by Vconf -m prep SDfile
Find this compound or compounds like it in BindingDB:
Activity Spreadsheet -- Enzyme Inhibition Constant Data from BindingDB
Found 2 hits for monomerid = 50316117
TargetDihydrofolate reductase(Bos taurus (Cattle))
King Saud University
Curated by ChEMBL
LigandPNGBDBM50316117(2-Allylthio-3-benzyl-6-diallylamino-quinazolin-4(3...)
Affinity DataIC50:  400nM. Assay description: Inhibition of bovine DHFR after 2 mins
In DepthDetails ArticlePubMed
TargetDihydrofolate reductase(Homo sapiens (Human))
King Saud University
Curated by ChEMBL
LigandPNGBDBM50316117(2-Allylthio-3-benzyl-6-diallylamino-quinazolin-4(3...)
Affinity DataIC50:  900nM. Assay description: Inhibition of human DHFR after 2 mins
In DepthDetails ArticlePubMed