BDBM50316120 6-Allylamino-3-benzyl-2-methylthio-quinazolin-4(3H)-one::CHEMBL1089230
SMILES CSc1nc2ccc(NCC=C)cc2c(=O)n1Cc1ccccc1
InChI Key InChIKey=WGWRCKSVBVQJPR-UHFFFAOYSA-N
Data  2 IC50
  Tab Delimited (TSV)   2D SDfile   Computed 3D by Vconf -m prep SDfile
Find this compound or compounds like it in BindingDB:
Activity Spreadsheet -- Enzyme Inhibition Constant Data from BindingDB
Found 2 hits for monomerid = 50316120
TargetDihydrofolate reductase(Bos taurus (Cattle))
King Saud University
Curated by ChEMBL
LigandPNGBDBM50316120(6-Allylamino-3-benzyl-2-methylthio-quinazolin-4(3H...)
Affinity DataIC50:  600nM. Assay description: Inhibition of bovine DHFR after 2 mins
In DepthDetails ArticlePubMed
TargetDihydrofolate reductase(Homo sapiens (Human))
King Saud University
Curated by ChEMBL
LigandPNGBDBM50316120(6-Allylamino-3-benzyl-2-methylthio-quinazolin-4(3H...)
Affinity DataIC50:  800nM. Assay description: Inhibition of human DHFR after 2 mins
In DepthDetails ArticlePubMed