BDBM50316164 2,6-Diisopropylphenyl{[1-Benzoyl-4-(3-methoxyphenyl)piperidin-4-yl]carbonyl}sulfamate::CHEMBL1091252
SMILES COc1cccc(c1)C1(CCN(CC1)C(=O)c1ccccc1)C(=O)NS(=O)(=O)Oc1c(cccc1C(C)C)C(C)C
InChI Key InChIKey=KMZQMQCPALRKSR-UHFFFAOYSA-N
Data  1 IC50
  Tab Delimited (TSV)   2D SDfile   Computed 3D by Vconf -m prep SDfile
Find this compound or compounds like it in BindingDB:
Activity Spreadsheet -- Enzyme Inhibition Constant Data from BindingDB
Found 1 hit for monomerid = 50316164
TargetSterol O-acyltransferase 1(Rattus norvegicus)
Dainippon Sumitomo Pharma
Curated by ChEMBL
LigandPNGBDBM50316164(2,6-Diisopropylphenyl{[1-Benzoyl-4-(3-methoxypheny...)
Affinity DataIC50: >1.00E+3nM. Assay description: Inhibition of rat macrophages ACAT
In DepthDetails ArticlePubMed