BDBM50316232 2-(4-(2-(methylamino)ethyl)phenyl)-2H-indazole-7-carboxamide::CHEMBL1097619
SMILES CNCCc1ccc(cc1)-n1cc2cccc(C(N)=O)c2n1
InChI Key InChIKey=VUYQINRDXZOOKH-UHFFFAOYSA-N
Data  1 IC50
  Tab Delimited (TSV)   2D SDfile   Computed 3D by Vconf -m prep SDfile
Find this compound or compounds like it in BindingDB:
Activity Spreadsheet -- Enzyme Inhibition Constant Data from BindingDB
Found 1 hit for monomerid = 50316232
TargetPoly [ADP-ribose] polymerase 1(Homo sapiens (Human))
Irbm/Merck Research Laboratories
Curated by ChEMBL
LigandPNGBDBM50316232(2-(4-(2-(methylamino)ethyl)phenyl)-2H-indazole-7-c...)
Affinity DataIC50:  200nM. Assay description: Inhibition of human PARP1 by SPA
In DepthDetails ArticlePubMed