BDBM50316317 ((2R,3S,4R,5R)-5-(2-Amino-7-(3-nitrobenzyl)-6-oxo-1Hpurin-1-ium-9(6H)-yl)-3,4-dihydroxytetrahydrofuran-2-yl)methylphosphate::CHEMBL1094640
SMILES Nc1nc2n(c[n+](Cc3cccc(c3)[N+]([O-])=O)c2c(=O)[nH]1)[C@@H]1O[C@H](CO[P+](O)([O-])[O-])[C@@H](O)[C@H]1O
InChI Key InChIKey=SUMJIKRGNXINOK-XNIJJKJLSA-N
Data  1 Kd
  Tab Delimited (TSV)   2D SDfile   Computed 3D by Vconf -m prep SDfile
Find this compound or compounds like it in BindingDB:
Activity Spreadsheet -- Enzyme Inhibition Constant Data from BindingDB
Found 1 hit for monomerid = 50316317
TargetEukaryotic translation initiation factor 4E(Mus musculus)
University Of Minnesota
Curated by ChEMBL
LigandPNGBDBM50316317(((2R,3S,4R,5R)-5-(2-Amino-7-(3-nitrobenzyl)-6-oxo-...)
Affinity DataKd:  1.44E+4nM. Assay description: Binding affinity to mouse eIF4E expressed in Escherichia coli by fluorescence time-synchronized titration method in presence of KKRYDREFLLGFQFIFA
In DepthDetails ArticlePubMed