BDBM50316318 ((2R,3S,4R,5R)-5-(2-Amino-7-(3-methylbenzyl)-6-oxo-1Hpurin-1-ium-9(6H)-yl)-3,4-dihydroxytetrahydrofuran-2-yl)methylphosphate::CHEMBL1097967
SMILES Cc1cccc(C[n+]2cn([C@@H]3O[C@H](COP(O)([O-])=O)[C@@H](O)[C@H]3O)c3nc(N)[nH]c(=O)c23)c1
InChI Key InChIKey=ZDYDOHUYLVONDN-LSCFUAHRSA-N
Data  1 Kd
  Tab Delimited (TSV)   2D SDfile   Computed 3D by Vconf -m prep SDfile
Find this compound or compounds like it in BindingDB:
Activity Spreadsheet -- Enzyme Inhibition Constant Data from BindingDB
Found 1 hit for monomerid = 50316318
TargetEukaryotic translation initiation factor 4E(Mus musculus)
University Of Minnesota
Curated by ChEMBL
LigandPNGBDBM50316318(((2R,3S,4R,5R)-5-(2-Amino-7-(3-methylbenzyl)-6-oxo...)
Affinity DataKd:  1.58E+4nM. Assay description: Binding affinity to mouse eIF4E expressed in Escherichia coli by fluorescence time-synchronized titration method in presence of KKRYDREFLLGFQFIFA
In DepthDetails ArticlePubMed