BDBM50316420 (1R,3R)Methyl 1-(2-bromophenyl)-2,3,4,9-tetrahydro-1H-bcarboline-3-carboxylate::CHEMBL1098959
SMILES COC(=O)[C@H]1Cc2c([nH]c3ccccc23)[C@H](N1)c1ccccc1Br
InChI Key InChIKey=QXOOUBWXLCUYFT-IAGOWNOFSA-N
Data  1 IC50
  Tab Delimited (TSV)   2D SDfile   Computed 3D by Vconf -m prep SDfile
Find this compound or compounds like it in BindingDB:
Activity Spreadsheet -- Enzyme Inhibition Constant Data from BindingDB
Found 1 hit for monomerid = 50316420
TargetcGMP-specific 3',5'-cyclic phosphodiesterase(Homo sapiens (Human))
German University In Cairo
Curated by ChEMBL
LigandPNGBDBM50316420((1R,3R)Methyl 1-(2-bromophenyl)-2,3,4,9-tetrahydro...)
Affinity DataIC50:  5.60E+3nM. Assay description: Inhibition of human recombinant PDE5 after 1.5 hrs by fluorescent polarization assay
In DepthDetails ArticlePubMed