BDBM50316584 4-amino-1-((2R,4S,6R)-4-fluoro-3,5-dihydroxy-6-(hydroxymethyl)tetrahydro-2H-pyran-2-yl)pyrimidin-2(1H)-one::CHEMBL1095544
SMILES Nc1ccn([C@@H]2O[C@H](CO)C(O)[C@H](F)C2O)c(=O)n1
InChI Key InChIKey=AGFREDUIXIMAKC-JDINWHEISA-N
Data  1 KI
  Tab Delimited (TSV)   2D SDfile   Computed 3D by Vconf -m prep SDfile
Find this compound or compounds like it in BindingDB:
Activity Spreadsheet -- Enzyme Inhibition Constant Data from BindingDB
Found 1 hit for monomerid = 50316584
TargetGlycogen phosphorylase, muscle form(Oryctolagus cuniculus (rabbit))
National Hellenic Research Foundation
Curated by ChEMBL
LigandPNGBDBM50316584(4-amino-1-((2R,4S,6R)-4-fluoro-3,5-dihydroxy-6-(hy...)
Affinity DataKi:  4.01E+6nM. Assay description: Inhibition of rabbit muscle glycogen phosphorylase inactive form b
In DepthDetails ArticlePubMed