BDBM50316588 1-D-glucopyranosyl cytosine::4-amino-1-beta-D-glucopyranosylpyrimidin-2(1H)-one::CHEMBL1096136
SMILES Nc1ccn([C@@H]2O[C@H](CO)[C@@H](O)[C@H](O)[C@H]2O)c(=O)n1
InChI Key InChIKey=YYUQXKHCNLFJNF-DDIGBBAMSA-N
Data  1 KI
PDB links: 1 PDB ID matches this monomer.
  Tab Delimited (TSV)   2D SDfile   Computed 3D by Vconf -m prep SDfile
Find this compound or compounds like it in BindingDB:
Activity Spreadsheet -- Enzyme Inhibition Constant Data from BindingDB
Found 1 hit for monomerid = 50316588
TargetGlycogen phosphorylase, muscle form(Oryctolagus cuniculus (rabbit))
National Hellenic Research Foundation
Curated by ChEMBL
LigandPNGBDBM50316588(1-D-glucopyranosyl cytosine | 4-amino-1-beta-D-glu...)
Affinity DataKi:  7.70E+3nM. Assay description: Inhibition of rabbit muscle glycogen phosphorylase inactive form b