BDBM50316668 5-(4-aminopiperidin-1-yl)-1-(2-ethoxyethyl)-3-methyl-N-(4-methylpyridin-2-yl)-1H-pyrazolo[4,3-d]pyrimidin-7-amine::CHEMBL1094500
SMILES CCOCCn1nc(C)c2nc(nc(Nc3cc(C)ccn3)c12)N1CCC(N)CC1
InChI Key InChIKey=CBFHNFARORPLLQ-UHFFFAOYSA-N
Data  1 IC50
  Tab Delimited (TSV)   2D SDfile   Computed 3D by Vconf -m prep SDfile
Find this compound or compounds like it in BindingDB:
Activity Spreadsheet -- Enzyme Inhibition Constant Data from BindingDB
Found 1 hit for monomerid = 50316668
TargetcGMP-specific 3',5'-cyclic phosphodiesterase(Homo sapiens (Human))
Pfizer
Curated by ChEMBL
LigandPNGBDBM50316668(5-(4-aminopiperidin-1-yl)-1-(2-ethoxyethyl)-3-meth...)
Affinity DataIC50:  2.30nM. Assay description: Inhibition of PDE5 in human platelet by assessed as hydrolysis of [3H]cGMP scintillation proximity assay
In DepthDetails ArticlePubMed