BDBM50316718 (Z,Z)-5-(3-Hydroxy-benzylidene)-2-isopropylimino-3-phenyl-thiazolidin-4-one::CHEMBL1098771
SMILES CC(C)\N=C1/S\C(=C/c2cccc(O)c2)C(=O)N1c1ccccc1
InChI Key InChIKey=PYPGLNSMDWAOMZ-QTBWCZOLSA-N
Data  2 EC50
  Tab Delimited (TSV)   2D SDfile   Computed 3D by Vconf -m prep SDfile
Find this compound or compounds like it in BindingDB:
Activity Spreadsheet -- Enzyme Inhibition Constant Data from BindingDB
Found 2 hits for monomerid = 50316718
TargetSphingosine 1-phosphate receptor 1(Homo sapiens (Human))
Actelion Pharmaceuticals
Curated by ChEMBL
LigandPNGBDBM50316718((Z,Z)-5-(3-Hydroxy-benzylidene)-2-isopropylimino-3...)
Affinity DataEC50:  752nM. Assay description: Agonist activity at human recombinant S1P1 receptor expressed in CHO cells by GTPgammaS binding assay
In DepthDetails ArticlePubMed
TargetSphingosine 1-phosphate receptor 3(Homo sapiens (Human))
Actelion Pharmaceuticals
Curated by ChEMBL
LigandPNGBDBM50316718((Z,Z)-5-(3-Hydroxy-benzylidene)-2-isopropylimino-3...)
Affinity DataEC50:  103nM. Assay description: Agonist activity at human recombinant S1P3 receptor expressed in CHO cells by GTPgammaS binding assay
In DepthDetails ArticlePubMed