BDBM50316728 (Z,Z)-5-Benzylidene-2-isopropylimino-3-phenyl-thiazolidin-4-one::CHEMBL1095987
SMILES CC(C)\N=C1/S\C(=C/c2ccccc2)C(=O)N1c1ccccc1
InChI Key InChIKey=UKTGTQHPUPYVQH-CJGMICOPSA-N
Data  2 EC50
  Tab Delimited (TSV)   2D SDfile   Computed 3D by Vconf -m prep SDfile
Find this compound or compounds like it in BindingDB:
Activity Spreadsheet -- Enzyme Inhibition Constant Data from BindingDB
Found 2 hits for monomerid = 50316728
TargetSphingosine 1-phosphate receptor 1(Homo sapiens (Human))
Actelion Pharmaceuticals
Curated by ChEMBL
LigandPNGBDBM50316728((Z,Z)-5-Benzylidene-2-isopropylimino-3-phenyl-thia...)
Affinity DataEC50:  1.24E+3nM. Assay description: Agonist activity at human recombinant S1P1 receptor expressed in CHO cells by GTPgammaS binding assay
In DepthDetails ArticlePubMed
TargetSphingosine 1-phosphate receptor 3(Homo sapiens (Human))
Actelion Pharmaceuticals
Curated by ChEMBL
LigandPNGBDBM50316728((Z,Z)-5-Benzylidene-2-isopropylimino-3-phenyl-thia...)
Affinity DataEC50:  317nM. Assay description: Agonist activity at human recombinant S1P3 receptor expressed in CHO cells by GTPgammaS binding assay
In DepthDetails ArticlePubMed