BDBM50316748 (Z,Z)-3-Allyl-5-(3-chloro-4-hydroxy-benzylidene)-2-isopropylimino-thiazolidin-4-one::CHEMBL1094831
SMILES CC(C)\N=C1/S\C(=C/c2ccc(O)c(Cl)c2)C(=O)N1CC=C
InChI Key InChIKey=FXXMIRTUIIEVPV-BSYVZCAJSA-N
Data  2 EC50
  Tab Delimited (TSV)   2D SDfile   Computed 3D by Vconf -m prep SDfile
Find this compound or compounds like it in BindingDB:
Activity Spreadsheet -- Enzyme Inhibition Constant Data from BindingDB
Found 2 hits for monomerid = 50316748
TargetSphingosine 1-phosphate receptor 1(Homo sapiens (Human))
Actelion Pharmaceuticals
Curated by ChEMBL
LigandPNGBDBM50316748((Z,Z)-3-Allyl-5-(3-chloro-4-hydroxy-benzylidene)-2...)
Affinity DataEC50:  55nM. Assay description: Agonist activity at human recombinant S1P1 receptor expressed in CHO cells by GTPgammaS binding assay
In DepthDetails ArticlePubMed
TargetSphingosine 1-phosphate receptor 3(Homo sapiens (Human))
Actelion Pharmaceuticals
Curated by ChEMBL
LigandPNGBDBM50316748((Z,Z)-3-Allyl-5-(3-chloro-4-hydroxy-benzylidene)-2...)
Affinity DataEC50:  821nM. Assay description: Agonist activity at human recombinant S1P3 receptor expressed in CHO cells by GTPgammaS binding assay
In DepthDetails ArticlePubMed