BDBM50316756 (Z,Z)-5-(3-Chloro-4-hydroxy-benzylidene)-2-cyclobutylimino-3-phenyl-thiazolidin-4-one::CHEMBL1098450
SMILES Oc1ccc(\C=C2/S\C(=N/C3CCC3)N(C2=O)c2ccccc2)cc1Cl
InChI Key InChIKey=XKWZMCIVMJIINF-JLZFKDTQSA-N
Data  2 EC50
  Tab Delimited (TSV)   2D SDfile   Computed 3D by Vconf -m prep SDfile
Find this compound or compounds like it in BindingDB:
Activity Spreadsheet -- Enzyme Inhibition Constant Data from BindingDB
Found 2 hits for monomerid = 50316756
TargetSphingosine 1-phosphate receptor 1(Homo sapiens (Human))
Actelion Pharmaceuticals
Curated by ChEMBL
LigandPNGBDBM50316756((Z,Z)-5-(3-Chloro-4-hydroxy-benzylidene)-2-cyclobu...)
Affinity DataEC50:  202nM. Assay description: Agonist activity at human recombinant S1P1 receptor expressed in CHO cells by GTPgammaS binding assay
In DepthDetails ArticlePubMed
TargetSphingosine 1-phosphate receptor 3(Homo sapiens (Human))
Actelion Pharmaceuticals
Curated by ChEMBL
LigandPNGBDBM50316756((Z,Z)-5-(3-Chloro-4-hydroxy-benzylidene)-2-cyclobu...)
Affinity DataEC50:  128nM. Assay description: Agonist activity at human recombinant S1P3 receptor expressed in CHO cells by GTPgammaS binding assay
In DepthDetails ArticlePubMed