BDBM50316760 (Z,Z)-5-(3-Chloro-4-hydroxy-benzylidene)-2-isopropylimino-3-phenyl-thiazolidin-4-one::CHEMBL1094192
SMILES CC(C)\N=C1/S\C(=C/c2ccc(O)c(Cl)c2)C(=O)N1c1ccccc1
InChI Key InChIKey=GDSQHSWSFDEWPD-WQZDFCHPSA-N
Data  2 EC50
  Tab Delimited (TSV)   2D SDfile   Computed 3D by Vconf -m prep SDfile
Find this compound or compounds like it in BindingDB:
Activity Spreadsheet -- Enzyme Inhibition Constant Data from BindingDB
Found 2 hits for monomerid = 50316760
TargetSphingosine 1-phosphate receptor 1(Homo sapiens (Human))
Actelion Pharmaceuticals
Curated by ChEMBL
LigandPNGBDBM50316760((Z,Z)-5-(3-Chloro-4-hydroxy-benzylidene)-2-isoprop...)
Affinity DataEC50:  47nM. Assay description: Agonist activity at human recombinant S1P1 receptor expressed in CHO cells by GTPgammaS binding assay
In DepthDetails ArticlePubMed
TargetSphingosine 1-phosphate receptor 3(Homo sapiens (Human))
Actelion Pharmaceuticals
Curated by ChEMBL
LigandPNGBDBM50316760((Z,Z)-5-(3-Chloro-4-hydroxy-benzylidene)-2-isoprop...)
Affinity DataEC50:  120nM. Assay description: Agonist activity at human recombinant S1P3 receptor expressed in CHO cells by GTPgammaS binding assay
In DepthDetails ArticlePubMed