BDBM50316766 (Z,Z)-5-(3-Chloro-4-hydroxy-benzylidene)-2-(dimethyl-hydrazono)-3-phenylthiazolidin-4-one::CHEMBL1096786
SMILES CN(C)\N=C1/S\C(=C/c2ccc(O)c(Cl)c2)C(=O)N1c1ccccc1
InChI Key InChIKey=DSYDKTHRNZYJSG-JTHVCAJSSA-N
Data  2 EC50
  Tab Delimited (TSV)   2D SDfile   Computed 3D by Vconf -m prep SDfile
Find this compound or compounds like it in BindingDB:
Activity Spreadsheet -- Enzyme Inhibition Constant Data from BindingDB
Found 2 hits for monomerid = 50316766
TargetSphingosine 1-phosphate receptor 1(Homo sapiens (Human))
Actelion Pharmaceuticals
Curated by ChEMBL
LigandPNGBDBM50316766((Z,Z)-5-(3-Chloro-4-hydroxy-benzylidene)-2-(dimeth...)
Affinity DataEC50:  62nM. Assay description: Agonist activity at human recombinant S1P1 receptor expressed in CHO cells by GTPgammaS binding assay
In DepthDetails ArticlePubMed
TargetSphingosine 1-phosphate receptor 3(Homo sapiens (Human))
Actelion Pharmaceuticals
Curated by ChEMBL
LigandPNGBDBM50316766((Z,Z)-5-(3-Chloro-4-hydroxy-benzylidene)-2-(dimeth...)
Affinity DataEC50:  140nM. Assay description: Agonist activity at human recombinant S1P3 receptor expressed in CHO cells by GTPgammaS binding assay
In DepthDetails ArticlePubMed