BDBM50316804 (1'R,2'S,3'R,4'R)-1-[2,3-Dihydroxy-4-(hydroxymethyl)-cyclopentan-1-yl]-6-(4-cyanobenzyl-thio)purine::CHEMBL1094895
SMILES OC[C@H]1C[C@H]([C@H](O)[C@@H]1O)n1cnc2c(SCc3ccc(cc3)C#N)ncnc12
InChI Key InChIKey=HSJWVMCVEXNVOX-SRABZTEZSA-N
Data  1 KI
  Tab Delimited (TSV)   2D SDfile   Computed 3D by Vconf -m prep SDfile
Find this compound or compounds like it in BindingDB:
Activity Spreadsheet -- Enzyme Inhibition Constant Data from BindingDB
Found 1 hit for monomerid = 50316804
TargetAdenosine kinase(Toxoplasma gondii)
University Of Georgia
Curated by ChEMBL
LigandPNGBDBM50316804((1'R,2'S,3'R,4'R)-1-[2,3-Dihydroxy-4-(hydroxymethy...)
Affinity DataKi:  1.29E+5nM. Assay description: Binding affinity to Toxoplasma gondii adenosine kinase after 20 mins by radioactivity method
In DepthDetails ArticlePubMed