BDBM50316807 (1'R,2'S,3'R,4'R)-1-[2,3-Dihydroxy-4-(hydroxymethyl)-cyclopentan-1-yl]-6-(4-methyl-sulfonylbenzylthio)purine::CHEMBL1096805
SMILES CS(=O)(=O)c1ccc(CSc2ncnc3n(cnc23)[C@@H]2C[C@H](CO)[C@@H](O)[C@H]2O)cc1
InChI Key InChIKey=GDHTVTHUCPOZER-WNOSKKOXSA-N
Data  1 KI
  Tab Delimited (TSV)   2D SDfile   Computed 3D by Vconf -m prep SDfile
Find this compound or compounds like it in BindingDB:
Activity Spreadsheet -- Enzyme Inhibition Constant Data from BindingDB
Found 1 hit for monomerid = 50316807
TargetAdenosine kinase(Toxoplasma gondii)
University Of Georgia
Curated by ChEMBL
LigandPNGBDBM50316807((1'R,2'S,3'R,4'R)-1-[2,3-Dihydroxy-4-(hydroxymethy...)
Affinity DataKi:  7.37E+4nM. Assay description: Binding affinity to Toxoplasma gondii adenosine kinase after 20 mins by radioactivity method
In DepthDetails ArticlePubMed