BDBM50316852 CHEMBL4171446
SMILES Oc1nc(ncc1NC(=O)Cc1ccc(cc1)-c1ccccc1)-n1cccn1
InChI Key InChIKey=IVVGUPBQCNZMHZ-UHFFFAOYSA-N
Data  1 IC50
  Tab Delimited (TSV)   2D SDfile   Computed 3D by Vconf -m prep SDfile
Find this compound or compounds like it in BindingDB:
Activity Spreadsheet -- Enzyme Inhibition Constant Data from BindingDB
Found 1 hit for monomerid = 50316852
TargetEgl nine homolog 1(Homo sapiens (Human))
Cadila Healthcare
Curated by ChEMBL
LigandPNGBDBM50316852(CHEMBL4171446)
Affinity DataIC50:  0.700nM. Assay description: Inhibition of FLAG- tagged full length HIF-PHD2 (unknown origin) expressed in baculovirus-infected Sf9 cells using biotin labelled DLDLEMLAPYIPMDDDFQ...
Ligand InfoPC cidPC sid
In DepthDetails ArticlePubMed