BDBM50316889 2-amino-4-phenyl-8-(2-(pyrrolidin-1-yl)ethoxy)-5H-indeno[1,2-d]pyrimidin-5-one::CHEMBL1095490
SMILES Nc1nc2-c3cc(OCCN4CCCC4)ccc3C(=O)c2c(n1)-c1ccccc1
InChI Key InChIKey=DWAWMNJZTVBRAL-UHFFFAOYSA-N
Data  2 KI
  Tab Delimited (TSV)   2D SDfile   Computed 3D by Vconf -m prep SDfile
Find this compound or compounds like it in BindingDB:
Activity Spreadsheet -- Enzyme Inhibition Constant Data from BindingDB
Found 2 hits for monomerid = 50316889
TargetAdenosine receptor A2a(Homo sapiens (Human))
Johnson & Johnson Pharmaceutical Research And Development
Curated by ChEMBL
LigandPNGBDBM50316889(2-amino-4-phenyl-8-(2-(pyrrolidin-1-yl)ethoxy)-5H-...)
Affinity DataKi:  19.3nM. Assay description: Antagonistic activity at adenosine A2A receptor
In DepthDetails ArticlePubMed
TargetAdenosine receptor A1(Homo sapiens (Human))
Johnson & Johnson Pharmaceutical Research And Development
Curated by ChEMBL
LigandPNGBDBM50316889(2-amino-4-phenyl-8-(2-(pyrrolidin-1-yl)ethoxy)-5H-...)
Affinity DataKi:  159nM. Assay description: Antagonistic activity at adenosine A1 receptor
In DepthDetails ArticlePubMed