BDBM50317171 (2'Z,3'E)-5-Fluoro-5'-fluoro-indirubin-3'-oxime::CHEMBL1087075
SMILES Fc1ccc2NC(=O)C(c2c1)c1[nH]c2ccc(F)cc2c1N=O
InChI Key InChIKey=VYZAPDAKHHQPCT-UHFFFAOYSA-N
Data  1 IC50
  Tab Delimited (TSV)   2D SDfile   Computed 3D by Vconf -m prep SDfile
Find this compound or compounds like it in BindingDB:
Activity Spreadsheet -- Enzyme Inhibition Constant Data from BindingDB
Found 1 hit for monomerid = 50317171
TargetCyclin-dependent kinase 2/G1/S-specific cyclin-E1(Homo sapiens (Human))
Institute Of Science And Technology
Curated by ChEMBL
LigandPNGBDBM50317171((2'Z,3'E)-5-Fluoro-5'-fluoro-indirubin-3'-oxime | ...)
Affinity DataIC50:  1.80nM. Assay description: Inhibition of CDK2/cyclin E
In DepthDetails ArticlePubMed