BDBM50317411 5-(Aminosulfonyl)-N-[2-(4-methoxyphenyl)ethyl]-2-[(2,3,5,6-tetrafluorophenyl)thio]nicotinamide::CHEMBL1099152
SMILES COc1ccc(CCCNC(=O)c2cc(cnc2Sc2c(F)c(F)cc(F)c2F)S(N)(=O)=O)cc1
InChI Key InChIKey=LQGBGIQOCRJGKR-UHFFFAOYSA-N
Data  2 IC50
  Tab Delimited (TSV)   2D SDfile   Computed 3D by Vconf -m prep SDfile
Find this compound or compounds like it in BindingDB:
Activity Spreadsheet -- Enzyme Inhibition Constant Data from BindingDB
Found 2 hits for monomerid = 50317411
TargetCarbonic anhydrase 4(Homo sapiens (Human))
Pfizer
Curated by ChEMBL
LigandPNGBDBM50317411(5-(Aminosulfonyl)-N-[2-(4-methoxyphenyl)ethyl]-2-[...)
Affinity DataIC50:  23nM. Assay description: Inhibition of carbonic anhydrase 4
In DepthDetails ArticlePubMed
TargetCarbonic anhydrase 2(Homo sapiens (Human))
Pfizer
Curated by ChEMBL
LigandPNGBDBM50317411(5-(Aminosulfonyl)-N-[2-(4-methoxyphenyl)ethyl]-2-[...)
Affinity DataIC50:  11.5nM. Assay description: Inhibition of carbonic anhydrase 2
In DepthDetails ArticlePubMed