BDBM50317419 6-Dihydroparadol::CHEMBL1094101
SMILES CCCCCCCC(O)CCc1ccc(O)c(OC)c1
InChI Key InChIKey=DFOMASIWHAPFEW-UHFFFAOYSA-N
Data  1 KI
  Tab Delimited (TSV)   2D SDfile   Computed 3D by Vconf -m prep SDfile
Find this compound or compounds like it in BindingDB:
Activity Spreadsheet -- Enzyme Inhibition Constant Data from BindingDB
Found 1 hit for monomerid = 50317419
Target5-hydroxytryptamine receptor 1A(Homo sapiens (Human))
Department Of Chemistry And Applied Biosciences
Curated by ChEMBL
LigandPNGBDBM50317419(6-Dihydroparadol | CHEMBL1094101)
Affinity DataKi:  9.53E+3nM. Assay description: Displacement of [3H]8-OH-DPAT from 5HT1A receptor expressed in HEK293 cells after 2 hrs by liquid scintillation counting
In DepthDetails ArticlePubMed