BDBM50317443 1-(1-amino-7-benzyl-5-(piperidin-1-yl)-6,7,8,9-tetrahydro-3H-pyrazolo[3,4-c][2,7]naphthyridin-3-yl)ethanone::CHEMBL1097471
SMILES CC(=O)n1nc(N)c2c3CCN(Cc4ccccc4)Cc3c(nc12)N1CCCCC1
InChI Key InChIKey=FBEXOKGCNDBGIE-UHFFFAOYSA-N
Data  2 EC50
  Tab Delimited (TSV)   2D SDfile   Computed 3D by Vconf -m prep SDfile
Find this compound or compounds like it in BindingDB:
Activity Spreadsheet -- Enzyme Inhibition Constant Data from BindingDB
Found 2 hits for monomerid = 50317443
TargetBombesin receptor subtype-3(RAT)
Amri
Curated by ChEMBL
LigandPNGBDBM50317443(1-(1-amino-7-benzyl-5-(piperidin-1-yl)-6,7,8,9-tet...)
Affinity DataEC50:  759nM. Assay description: Agonist activity at rat BRS3 expressed in HEK293AEQ cells after 10 mins by aequorin bioluminescence assay
In DepthDetails ArticlePubMed
TargetBombesin receptor subtype-3(Homo sapiens (Human))
Amri
Curated by ChEMBL
LigandPNGBDBM50317443(1-(1-amino-7-benzyl-5-(piperidin-1-yl)-6,7,8,9-tet...)
Affinity DataEC50:  1.00E+4nM. Assay description: Agonist activity at human BRS3 expressed in HEK293AEQ cells after 10 mins by aequorin bioluminescence assay
In DepthDetails ArticlePubMed