BDBM50317705 4-((3S,5R)-5-(4-cyclopentyl-1,4-diazepane-1-carbonyl)pyrrolidin-3-yloxy)benzonitrile::CHEMBL1097883
SMILES O=C([C@H]1C[C@@H](CN1)Oc1ccc(cc1)C#N)N1CCCN(CC1)C1CCCC1
InChI Key InChIKey=DZMJATAIFBTELK-LEWJYISDSA-N
Data  2 KI  2 IC50
  Tab Delimited (TSV)   2D SDfile   Computed 3D by Vconf -m prep SDfile
Find this compound or compounds like it in BindingDB:
Activity Spreadsheet -- Enzyme Inhibition Constant Data from BindingDB
Found 4 hits for monomerid = 50317705
TargetHistamine H3 receptor(Homo sapiens (Human))
Johnson & Johnson Pharmaceutical Research & Development
Curated by ChEMBL
LigandPNGBDBM50317705(4-((3S,5R)-5-(4-cyclopentyl-1,4-diazepane-1-carbon...)
Affinity DataKi:  3.20nM. Assay description: Binding affinity to human histamine H3 receptor
In DepthDetails ArticlePubMed
TargetHistamine H3 receptor(Homo sapiens (Human))
Johnson & Johnson Pharmaceutical Research & Development
Curated by ChEMBL
LigandPNGBDBM50317705(4-((3S,5R)-5-(4-cyclopentyl-1,4-diazepane-1-carbon...)
Affinity DataKi:  4nM. Assay description: Displacement of [125I]Iodoproxyfan from human recombinant histamine H3 receptor by Competitive binding assay
In DepthDetails ArticlePubMed
TargetPotassium voltage-gated channel subfamily H member 2(Homo sapiens (Human))
Bioprojet-Biotech
Curated by ChEMBL
LigandPNGBDBM50317705(4-((3S,5R)-5-(4-cyclopentyl-1,4-diazepane-1-carbon...)
Affinity DataIC50:  2.90E+3nM. Assay description: Displacement of [3H]dofetilide from human recombinant ERG by Competitive binding assay
In DepthDetails ArticlePubMed
TargetPotassium voltage-gated channel subfamily H member 2(Homo sapiens (Human))
Bioprojet-Biotech
Curated by ChEMBL
LigandPNGBDBM50317705(4-((3S,5R)-5-(4-cyclopentyl-1,4-diazepane-1-carbon...)
Affinity DataIC50:  2.90E+3nM. Assay description: Displacement of labeled dofetilide human ERG
In DepthDetails ArticlePubMed