BDBM50317942 (+/-)-3-(3-(1-(1-ethylpiperidin-3-yl)-1H-benzo[d]imidazol-2-yl)phenyl)-N-hydroxyacrylamide::CHEMBL1095764
SMILES CCN1CCCC(C1)n1c(nc2ccccc12)-c1cccc(\C=C\C(=O)NO)c1
InChI Key InChIKey=RILOBLOUHFZQRQ-OUKQBFOZSA-N
Data  3 IC50
  Tab Delimited (TSV)   2D SDfile   Computed 3D by Vconf -m prep SDfile
Find this compound or compounds like it in BindingDB:
Activity Spreadsheet -- Enzyme Inhibition Constant Data from BindingDB
Found 3 hits for monomerid = 50317942
TargetHistone deacetylase 6(Homo sapiens (Human))
Takeda California
Curated by ChEMBL
LigandPNGBDBM50317942((+/-)-3-(3-(1-(1-ethylpiperidin-3-yl)-1H-benzo[d]i...)
Affinity DataIC50:  79nM. Assay description: Inhibition of human recombinant HDAC6
In DepthDetails ArticlePubMed
TargetHistone deacetylase 1(Homo sapiens (Human))
Takeda California
Curated by ChEMBL
LigandPNGBDBM50317942((+/-)-3-(3-(1-(1-ethylpiperidin-3-yl)-1H-benzo[d]i...)
Affinity DataIC50:  20nM. Assay description: Inhibition of human recombinant HDAC2
In DepthDetails ArticlePubMed
TargetHistone deacetylase 8(Homo sapiens (Human))
Takeda California
Curated by ChEMBL
LigandPNGBDBM50317942((+/-)-3-(3-(1-(1-ethylpiperidin-3-yl)-1H-benzo[d]i...)
Affinity DataIC50:  120nM. Assay description: Inhibition of human recombinant HDAC8
In DepthDetails ArticlePubMed