BDBM50319177 8-Methoxy-3,4-dimethyl-1-phenethyl-imidazo[1,5-a]pyrido[3,2-e]pyrazine::CHEMBL1085408
SMILES COc1ccc2nc(C)c3c(C)nc(CCc4ccccc4)n3c2n1
InChI Key InChIKey=KPRLWRVEXAZMEW-UHFFFAOYSA-N
Data  1 IC50
  Tab Delimited (TSV)   2D SDfile   Computed 3D by Vconf -m prep SDfile
Find this compound or compounds like it in BindingDB:
Activity Spreadsheet -- Enzyme Inhibition Constant Data from BindingDB
Found 1 hit for monomerid = 50319177
TargetcAMP and cAMP-inhibited cGMP 3',5'-cyclic phosphodiesterase 10A(Homo sapiens (Human))
Biotie Therapies
Curated by ChEMBL
LigandPNGBDBM50319177(8-Methoxy-3,4-dimethyl-1-phenethyl-imidazo[1,5-a]p...)
Affinity DataIC50:  116nM. Assay description: Inhibition of human recombinant PDE10A expressed in baculovirus-SF21 cell system assessed as hydrolysis of [3H]cAMP after 1 hr by liquid scintillatio...
In DepthDetails ArticlePubMed