BDBM50319180 4,8-Dimethoxy-1-propyl-imidazo[1,5-a]pyrido[3,2-e]pyrazine::CHEMBL1083163
SMILES CCCc1ncc2c(OC)nc3ccc(OC)nc3n12
InChI Key InChIKey=CTPKVFHCCFZNDJ-UHFFFAOYSA-N
Data  1 IC50
  Tab Delimited (TSV)   2D SDfile   Computed 3D by Vconf -m prep SDfile
Find this compound or compounds like it in BindingDB:
Activity Spreadsheet -- Enzyme Inhibition Constant Data from BindingDB
Found 1 hit for monomerid = 50319180
TargetcAMP and cAMP-inhibited cGMP 3',5'-cyclic phosphodiesterase 10A(Homo sapiens (Human))
Biotie Therapies
Curated by ChEMBL
LigandPNGBDBM50319180(4,8-Dimethoxy-1-propyl-imidazo[1,5-a]pyrido[3,2-e]...)
Affinity DataIC50:  92nM. Assay description: Inhibition of human recombinant PDE10A expressed in baculovirus-SF21 cell system assessed as hydrolysis of [3H]cAMP after 1 hr by liquid scintillatio...
In DepthDetails ArticlePubMed