BDBM50319264 2-(4-(((2-(2,4-dimethylphenylamino)-2-oxoethyl)(thiophen-2-ylmethyl)amino)methyl)phenoxy)-2-methylpropanoic acid::CHEMBL1085062
SMILES Cc1ccc(NC(=O)CN(Cc2cccs2)Cc2ccc(OC(C)(C)C(O)=O)cc2)c(C)c1
InChI Key InChIKey=ZIDZJLMNJDVTDJ-UHFFFAOYSA-N
Data  1 EC50
  Tab Delimited (TSV)   2D SDfile   Computed 3D by Vconf -m prep SDfile
Find this compound or compounds like it in BindingDB:
Activity Spreadsheet -- Enzyme Inhibition Constant Data from BindingDB
Found 1 hit for monomerid = 50319264
TargetPeroxisome proliferator-activated receptor alpha(Homo sapiens (Human))
Bayer-Schering Pharma
Curated by ChEMBL
LigandPNGBDBM50319264(2-(4-(((2-(2,4-dimethylphenylamino)-2-oxoethyl)(th...)
Affinity DataEC50:  700nM. Assay description: Agonist activity at Gal4-fused human PPARalpha
In DepthDetails ArticlePubMed